{"text_format":"1","workbook":"xlsx","n_sheets":5,"sheets":["P-alderskema","Deltid - hjælpeprogram","Beregning - pensalder v. deltid","Beregning - Periodevarighed","Tidsangivelser"],"not_rendered":{"charts":0,"images":0,"macros":1,"external_links":0,"defined_names":1,"comments":2,"pivot_tables":0},"unopened":[],"bounds":{"document_bytes":16777216,"sheet_cells":100000,"rows_first":2000,"rows_last":500,"rows_between":2000,"halvings":0,"cell_chars":16384,"cell_head_chars":4096},"cells_cut":0,"cells_raw":0,"read":"whole","date_system":"1900"}

{"sheet":"P-alderskema","index":0,"n_rows":56,"n_cols":13,"rows_kept":56,"cut":false,"hidden":false,"merged":[[56,5,57,6],[54,5,55,5],[31,0,37,0],[38,11,40,11],[39,1,39,2],[39,4,39,5],[38,6,38,7],[54,0,55,0],[43,5,43,6],[43,7,43,8],[48,11,50,11],[44,8,44,10],[45,8,45,10],[44,11,46,11],[14,11,19,11],[28,11,30,11],[14,8,14,10],[0,0,0,1],[16,0,19,0],[6,4,6,6],[9,4,9,6],[1,0,1,3],[13,1,13,4],[12,1,12,10],[7,4,7,7],[10,4,10,7],[22,11,24,11],[15,8,15,10]]}
["Pensionsalderskema"]
["Til brug ved fastsættelse og tilbud om forhøjelse af pensionsalderen, jf TPL §§ 4 og 4a"]
[]
["1.",null,"2."]
[null,"Fulde navn",null,"CPR.nr. XXXXXX-XXXX (PÅKRÆVET) "]
[]
["3.",null,"4.",null,null,null,null,null,"år","mdr","dage"]
[null,"Stillingsbetegnelse",null,"Dato for ansættelse i nuværende tjenestemandsstilling, DD-MM-YYYY (PÅKRÆVET)","Pensionsalder pr. dato for tjenestemandsansættelse, inkl indregning af evt. tidligere tjenestemandspensionsalder",null,null,null,{"$f":"I56","v":0},{"$f":"J56","v":0},{"$f":"K56","v":0}]
[]
["5.",null,"6.",null,null,null,null,null,"år","mdr","dage"]
[null,"Ansættelsesmyndighed (Pensionsalderansvarlig virksomhed)",null,"Lønramme - skalatrin","Der kan - mod overførsel af udtrædelsesgodtgørelse - tilbydes tjenestemanden en forhøjet pensionsalder på ",null,null,null,{"$f":"I39","v":0},{"$f":"J39","v":0},{"$f":"K39","v":0}]
[]
[7,"Nedenfor registreres alle ansættelser forud for den nuværende tjenestemandsansættelse"]
["7 A","Forudgående offentlig ansættelse med bidragsdefineret pensionsordning"]
[null,"Ansættelsesmyndighed",null,"Stilling","Beskæftigel-\nsesgrad","Navn på pensionsinstitut, hvortil der er betalt pensionsbidrag","I perioden\n",null,"Perioden udgør ",null,null,"Hvis der er tale om deltid, anvendes hjælpeprogrammet på næste faneblad"]
[null,null,null,null,null,null,"Fra\ndd-mm-åååå","Til\ndd-mm-åååå","Tast F9 for at beregne"]
[null,null,null,null,null,null,"Dato for 1. dag\ni ansættelsen","Dato for 1. dag \nude af ansættelsen","år","mdr","dage"]
[null,null,null,null,{"$f":"IF($L$27=\"DELTID\",'Deltid - hjælpeprogram'!F14,1)","v":1},null,null,null,{"$f":"IF($L$27=\"DELTID\",'Deltid - hjælpeprogram'!G14,'Beregning - Periodevarighed'!R11)","v":""},{"$f":"IF($L$27=\"DELTID\",'Deltid - hjælpeprogram'!H14,'Beregning - Periodevarighed'!S11)","v":""},{"$f":"IF($L$27=\"DELTID\",'Deltid - hjælpeprogram'!I14,'Beregning - Periodevarighed'!T11)","v":""},null,{"$f":"IF(OR(DAY(H18)=31,DAY(H18)=30,AND(MONTH(H18)=2,DAY(H18)=28),DAY(G18)=31,DAY(G18)=30,AND(MONTH(G18)=2,DAY(G18)=28)),\"Er du sikker på indtastningen? Er dette første dag i/ude af ansættelsen\",\"\")","v":""}]
[null,null,null,null,{"$f":"IF($L$27=\"DELTID\",'Deltid - hjælpeprogram'!F15,1)","v":1},null,null,null,{"$f":"IF($L$27=\"DELTID\",'Deltid - hjælpeprogram'!G15,'Beregning - Periodevarighed'!R12)","v":""},{"$f":"IF($L$27=\"DELTID\",'Deltid - hjælpeprogram'!H15,'Beregning - Periodevarighed'!S12)","v":""},{"$f":"IF($L$27=\"DELTID\",'Deltid - hjælpeprogram'!I15,'Beregning - Periodevarighed'!T12)","v":""},null,{"$f":"IF(OR(DAY(H19)=31,DAY(H19)=30,AND(MONTH(H19)=2,DAY(H19)=28),DAY(G19)=31,DAY(G19)=30,AND(MONTH(G19)=2,DAY(G19)=28)),\"Er du sikker på indtastningen? Er dette første dag i/ude af ansættelsen\",\"\")","v":""}]
[null,null,null,null,{"$f":"IF($L$27=\"DELTID\",'Deltid - hjælpeprogram'!F16,1)","v":1},null,null,null,{"$f":"IF($L$27=\"DELTID\",'Deltid - hjælpeprogram'!G16,'Beregning - Periodevarighed'!R13)","v":""},{"$f":"IF($L$27=\"DELTID\",'Deltid - hjælpeprogram'!H16,'Beregning - Periodevarighed'!S13)","v":""},{"$f":"IF($L$27=\"DELTID\",'Deltid - hjælpeprogram'!I16,'Beregning - Periodevarighed'!T13)","v":""},null,""]
{"$rows_left_out":37}
{"sheet":"Deltid - hjælpeprogram","index":1,"n_rows":45,"n_cols":13,"rows_kept":45,"cut":false,"hidden":false,"merged":[[10,6,10,8],[11,3,11,5],[0,1,0,7],[4,3,5,3],[4,6,4,7],[5,6,6,7],[10,1,10,2],[4,4,4,5],[10,3,10,5],[9,2,9,8],[36,3,36,5],[34,2,34,8],[35,1,35,2],[35,3,35,5],[35,6,35,8]]}
[null,"Pensionsalder optjent ved deltidsansættelse"]
[]
[null,"Indtast beskæftigelse (antal arbejdstimer pr. uge). OBS! Udfyld kun de grønne felter."]
[]
[null,"CPR",{"$f":"IF('P-alderskema'!D4=\"\",\"\",'P-alderskema'!D4)","v":""},null,"Tjenestemandsansat",null,{"$f":"'P-alderskema'!D7","v":"00:00:00"}]
[null,"Fødselsdato",{"$f":"IF(C5=\"\",\"\",DATE(MID($C$5,5,2),MID($C$5,3,2),LEFT($C$5,2)))","v":""}]
[null,"25 år",{"$f":"IF(C6=\"\",\"\",DATE(YEAR(C6)+25,MONTH(C6),DAY(C6)))","v":""}]
[]
[]
[null,"Oplysninger om ansættelse",null,null,null,null,null,null,null,null,"Samlet pensionsalder-optjening"]
[null,"Ansættelsesperioder",null,"Beskæftigelsesgrad\n",null,null,"Optjening af pensionsalder",null,null,null,"År","Md","Dag"]
[null,null,null,"Celle D14 ELLER Celle E14 skal altid være udfyldt for at arket kan beregne pensionsalder ved Deltid"]
[null,"Start","Slut","Timer pr. uge","Beskæftigelses-grad","Andel","År","Mdr","Dage",null,{"$f":"'Beregning - pensalder v. deltid'!X10","v":0},{"$f":"'Beregning - pensalder v. deltid'!X11","v":0},{"$f":"'Beregning - pensalder v. deltid'!X12","v":0}]
["Tabel 7A",{"$f":"IF('P-alderskema'!G18=\"\",\"\",'P-alderskema'!G18)","v":""},{"$f":"IF('P-alderskema'!H18=\"\",\"\",'P-alderskema'!H18)","v":""},null,null,{"$f":"IF(C14=\"\",\"\",IF(AND(D14=\"\",E14<>\"\"),ROUND(E14,4),IF(AND(E14=\"\",D14<>\"\"),ROUND(D14/37,4),IF(AND(D14<>\"\",E14<>\"\"),\"FALSK\",1))))","v":""},{"$f":"IF('Beregning - pensalder v. deltid'!N10=0,\"\",'Beregning - pensalder v. deltid'!N10)","v":""},{"$f":"IF('Beregning - pensalder v. deltid'!P10=0,\"\",'Beregning - pensalder v. deltid'!P10)","v":""},{"$f":"IF('Beregning - pensalder v. deltid'!R10=0,\"\",'Beregning - pensalder v. deltid'!R10)","v":""}]
[null,{"$f":"IF('P-alderskema'!G19=\"\",\"\",'P-alderskema'!G19)","v":""},{"$f":"IF('P-alderskema'!H19=\"\",\"\",'P-alderskema'!H19)","v":""},null,null,{"$f":"IF(C15=\"\",\"\",IF(AND(D15=\"\",E15<>\"\"),ROUND(E15,4),IF(AND(E15=\"\",D15<>\"\"),ROUND(D15/37,4),IF(AND(D15<>\"\",E15<>\"\"),\"FALSK\",1))))","v":""},{"$f":"IF('Beregning - pensalder v. deltid'!N11=0,\"\",'Beregning - pensalder v. deltid'!N11)","v":""},{"$f":"IF('Beregning - pensalder v. deltid'!P11=0,\"\",'Beregning - pensalder v. deltid'!P11)","v":""},{"$f":"IF('Beregning - pensalder v. deltid'!R11=0,\"\",'Beregning - pensalder v. deltid'!R11)","v":""}]
[null,{"$f":"IF('P-alderskema'!G20=\"\",\"\",'P-alderskema'!G20)","v":""},{"$f":"IF('P-alderskema'!H20=\"\",\"\",'P-alderskema'!H20)","v":""},null,null,"",{"$f":"IF('Beregning - pensalder v. deltid'!N12=0,\"\",'Beregning - pensalder v. deltid'!N12)","v":""},{"$f":"IF('Beregning - pensalder v. deltid'!P12=0,\"\",'Beregning - pensalder v. deltid'!P12)","v":""},{"$f":"IF('Beregning - pensalder v. deltid'!R12=0,\"\",'Beregning - pensalder v. deltid'!R12)","v":""}]
[null,{"$f":"IF('P-alderskema'!G21=\"\",\"\",'P-alderskema'!G21)","v":""},{"$f":"IF('P-alderskema'!H21=\"\",\"\",'P-alderskema'!H21)","v":""},null,null,"",{"$f":"IF('Beregning - pensalder v. deltid'!N13=0,\"\",'Beregning - pensalder v. deltid'!N13)","v":""},{"$f":"IF('Beregning - pensalder v. deltid'!P13=0,\"\",'Beregning - pensalder v. deltid'!P13)","v":""},{"$f":"IF('Beregning - pensalder v. deltid'!R13=0,\"\",'Beregning - pensalder v. deltid'!R13)","v":""}]
[null,{"$f":"IF('P-alderskema'!G22=\"\",\"\",'P-alderskema'!G22)","v":""},{"$f":"IF('P-alderskema'!H22=\"\",\"\",'P-alderskema'!H22)","v":""},null,null,"",{"$f":"IF('Beregning - pensalder v. deltid'!N14=0,\"\",'Beregning - pensalder v. deltid'!N14)","v":""},{"$f":"IF('Beregning - pensalder v. deltid'!P14=0,\"\",'Beregning - pensalder v. deltid'!P14)","v":""},{"$f":"IF('Beregning - pensalder v. deltid'!R14=0,\"\",'Beregning - pensalder v. deltid'!R14)","v":""}]
[null,{"$f":"IF('P-alderskema'!G23=\"\",\"\",'P-alderskema'!G23)","v":""},{"$f":"IF('P-alderskema'!H23=\"\",\"\",'P-alderskema'!H23)","v":""},null,null,"",{"$f":"IF('Beregning - pensalder v. deltid'!N15=0,\"\",'Beregning - pensalder v. deltid'!N15)","v":""},{"$f":"IF('Beregning - pensalder v. deltid'!P15=0,\"\",'Beregning - pensalder v. deltid'!P15)","v":""},{"$f":"IF('Beregning - pensalder v. deltid'!R15=0,\"\",'Beregning - pensalder v. deltid'!R15)","v":""}]
[null,{"$f":"IF('P-alderskema'!G24=\"\",\"\",'P-alderskema'!G24)","v":""},{"$f":"IF('P-alderskema'!H24=\"\",\"\",'P-alderskema'!H24)","v":""},null,null,"",{"$f":"IF('Beregning - pensalder v. deltid'!N16=0,\"\",'Beregning - pensalder v. deltid'!N16)","v":""},{"$f":"IF('Beregning - pensalder v. deltid'!P16=0,\"\",'Beregning - pensalder v. deltid'!P16)","v":""},{"$f":"IF('Beregning - pensalder v. deltid'!R16=0,\"\",'Beregning - pensalder v. deltid'!R16)","v":""}]
{"$rows_left_out":26}
{"sheet":"Beregning - pensalder v. deltid","index":2,"n_rows":39,"n_cols":24,"rows_kept":39,"cut":false,"hidden":true,"merged":[[7,2,7,3],[7,7,7,8],[0,1,0,5],[0,7,0,20],[2,10,2,12],[3,10,3,12],[6,1,6,5],[6,13,6,17]]}
[null,"Oplysninger",null,null,null,null,null,"DELTID - I: beregning af pensionsalder (optjent anciennitet)"]
[]
[null,null,"Fødselsdato",{"$f":"'Deltid - hjælpeprogram'!C6","v":""},null,null,null,"Tjm.ansat",{"$f":"IF('P-alderskema'!$D$7=\"\",NOW(),'P-alderskema'!$D$7)","v":"2021-06-02T14:58:07.810"},null,"0 = ansat efter 1/1-12 (optjening fra ansættelsesstart)."]
[null,null,"25 år",{"$f":"IF(D3=\"\",\"\",DATE(YEAR(D3)+25,MONTH(D3),DAY(D3)))","v":""},null,null,null,"Ansat før","2012-01-01",{"$f":"IF(I3<I4,1,0)","v":0},"1 = ansat før 1/1-12 (ingen optjening før 25. år)."]
[null,null,null,null,null,null,null,"Hvis tjm ansat før 1/1-12, da optjenes der ikke anciennitet før 25. årsdagen. "]
[]
[null,"Fra indlæsningsark",null,null,null,null,null,"Beregning - hver periode angivet i år med pågældende deltidskvotient",null,null,null,null,null,"Pensionsalder - år, mdr., dage samt rest"]
[null,null,"Ansættelsesperiode",null,null,"Beskæftigelsesgrad",null,"Ansættelsesperiode"]
[null,"Fyldt 25 år (start)","Start","Slut","Fyldt 25 år (slut) ","Deltidskvotient",null,"Start","Slut","Antal dage i periode","Deltids-kvotient","Dage (deltid)",null,"År","Rest","Mdr","Rest","Dage"]
["Tabel 7A",{"$f":"IF(C10=\"\",0,IF(C10<$D$4,0,1))","v":0},{"$f":"IF('Deltid - hjælpeprogram'!B14=\"\",\"\",'Deltid - hjælpeprogram'!B14)","v":""},{"$f":"IF('Deltid - hjælpeprogram'!C14=\"\",\"\",'Deltid - hjælpeprogram'!C14)","v":""},{"$f":"IF(D10=\"\",0,IF(D10<$D$4,0,1))","v":0},{"$f":"MAX('Deltid - hjælpeprogram'!F14,0)","v":0},null,{"$f":"IF($J$4=0,C10,IF(AND(B10=0,E10=1),$D$4,IF(AND(B10=1,E10=1),C10,\"-\")))","v":""},{"$f":"IF($J$4=0,D10,IF(E10=1,D10,\"-\"))","v":""},{"$f":"IF(OR(I10=\"-\",I10=\"\"),0,DAYS360(H10,I10,TRUE))","v":0},{"$f":"F10","v":0},{"$f":"J10*K10","v":0},null,{"$f":"TRUNC(L10/360)","v":0},{"$f":"L10-N10*360","v":0},{"$f":"TRUNC(O10/30)","v":0},{"$f":"O10-P10*30","v":0},{"$f":"TRUNC(Q10)","v":0},null,"År",{"$f":"N30","v":0},null,{"$f":"U10+W11","v":0},{"$f":"W10","v":0}]
[null,0,{"$f":"IF('Deltid - hjælpeprogram'!B15=\"\",\"\",'Deltid - hjælpeprogram'!B15)","v":""},{"$f":"IF('Deltid - hjælpeprogram'!C15=\"\",\"\",'Deltid - hjælpeprogram'!C15)","v":""},0,{"$f":"MAX('Deltid - hjælpeprogram'!F15,0)","v":0},null,"","",{"$f":"IF(OR(I11=\"-\",I11=\"\"),0,DAYS360(H11,I11,TRUE))","v":0},0,{"$f":"J11*K11","v":0},null,{"$f":"TRUNC(L11/360)","v":0},{"$f":"L11-N11*360","v":0},{"$f":"TRUNC(O11/30)","v":0},{"$f":"O11-P11*30","v":0},{"$f":"TRUNC(Q11)","v":0},null,"Mdr",{"$f":"P30","v":0},{"$f":"U11+V12","v":0},{"$f":"VLOOKUP(V11,Tidsangivelser!$E$4:$G$54,3,TRUE)","v":0},{"$f":"V11-W11*12","v":0}]
[null,0,{"$f":"IF('Deltid - hjælpeprogram'!B16=\"\",\"\",'Deltid - hjælpeprogram'!B16)","v":""},{"$f":"IF('Deltid - hjælpeprogram'!C16=\"\",\"\",'Deltid - hjælpeprogram'!C16)","v":""},0,{"$f":"MAX('Deltid - hjælpeprogram'!F16,0)","v":0},null,"","",0,0,0,null,0,0,0,0,0,null,"Dage",{"$f":"R30","v":0},{"$f":"VLOOKUP(U12,Tidsangivelser!$J$4:$L$54,3,TRUE)","v":0},null,{"$f":"U12-V12*30","v":0}]
[null,0,{"$f":"IF('Deltid - hjælpeprogram'!B17=\"\",\"\",'Deltid - hjælpeprogram'!B17)","v":""},{"$f":"IF('Deltid - hjælpeprogram'!C17=\"\",\"\",'Deltid - hjælpeprogram'!C17)","v":""},0,{"$f":"MAX('Deltid - hjælpeprogram'!F17,0)","v":0},null,"","",0,0,0,null,0,0,0,0,0]
[null,0,{"$f":"IF('Deltid - hjælpeprogram'!B18=\"\",\"\",'Deltid - hjælpeprogram'!B18)","v":""},{"$f":"IF('Deltid - hjælpeprogram'!C18=\"\",\"\",'Deltid - hjælpeprogram'!C18)","v":""},0,{"$f":"MAX('Deltid - hjælpeprogram'!F18,0)","v":0},null,"","",0,0,0,null,0,0,0,0,0]
[null,0,{"$f":"IF('Deltid - hjælpeprogram'!B19=\"\",\"\",'Deltid - hjælpeprogram'!B19)","v":""},{"$f":"IF('Deltid - hjælpeprogram'!C19=\"\",\"\",'Deltid - hjælpeprogram'!C19)","v":""},0,{"$f":"MAX('Deltid - hjælpeprogram'!F19,0)","v":0},null,"","",0,0,0,null,0,0,0,0,0]
[null,0,{"$f":"IF('Deltid - hjælpeprogram'!B20=\"\",\"\",'Deltid - hjælpeprogram'!B20)","v":""},{"$f":"IF('Deltid - hjælpeprogram'!C20=\"\",\"\",'Deltid - hjælpeprogram'!C20)","v":""},0,{"$f":"MAX('Deltid - hjælpeprogram'!F20,0)","v":0},null,"","",0,0,0,null,0,0,0,0,0]
[null,0,{"$f":"IF('Deltid - hjælpeprogram'!B21=\"\",\"\",'Deltid - hjælpeprogram'!B21)","v":""},{"$f":"IF('Deltid - hjælpeprogram'!C21=\"\",\"\",'Deltid - hjælpeprogram'!C21)","v":""},0,{"$f":"MAX('Deltid - hjælpeprogram'!F21,0)","v":0},null,"","",0,0,0,null,0,0,0,0,0]
[null,0,{"$f":"IF('Deltid - hjælpeprogram'!B22=\"\",\"\",'Deltid - hjælpeprogram'!B22)","v":""},{"$f":"IF('Deltid - hjælpeprogram'!C22=\"\",\"\",'Deltid - hjælpeprogram'!C22)","v":""},0,{"$f":"MAX('Deltid - hjælpeprogram'!F22,0)","v":0},null,"","",0,0,0,null,0,0,0,0,0]
[null,0,{"$f":"IF('Deltid - hjælpeprogram'!B23=\"\",\"\",'Deltid - hjælpeprogram'!B23)","v":""},{"$f":"IF('Deltid - hjælpeprogram'!C23=\"\",\"\",'Deltid - hjælpeprogram'!C23)","v":""},0,{"$f":"MAX('Deltid - hjælpeprogram'!F23,0)","v":0},null,"","",0,0,0,null,0,0,0,0,0]
[null,0,{"$f":"IF('Deltid - hjælpeprogram'!B24=\"\",\"\",'Deltid - hjælpeprogram'!B24)","v":""},{"$f":"IF('Deltid - hjælpeprogram'!C24=\"\",\"\",'Deltid - hjælpeprogram'!C24)","v":""},0,{"$f":"MAX('Deltid - hjælpeprogram'!F24,0)","v":0},null,"","",0,0,0,null,0,0,0,0,0]
{"$rows_left_out":20}
{"sheet":"Beregning - Periodevarighed","index":3,"n_rows":515,"n_cols":30,"rows_kept":515,"cut":false,"hidden":true,"merged":[[7,2,7,3],[0,12,1,19],[7,11,7,19]]}
[null,null,null,null,null,null,null,null,null,null,null,null,"FULDTID "]
[null,null,"CPR",{"$f":"IF('P-alderskema'!D4=\"\",\"\",'P-alderskema'!D4)","v":""}]
[null,null,"Fødselsdato",{"$f":"IF(D2=\"\",\"\",DATE(MID($D$2,5,2),MID($D$2,3,2),LEFT($D$2,2)))","v":""},null,null,null,"Tjm.ansat",{"$f":"IF('P-alderskema'!$D$7=\"\",NOW(),'P-alderskema'!$D$7)","v":"2021-06-02T14:58:07.810"},null,null,null,null,null,"År",{"$f":"SUM(L11:L34)","v":0},null,{"$f":"P3+R4","v":0},{"$f":"R3","v":0}]
[null,null,"25 år",{"$f":"IF(D3=\"\",\"\",DATE(YEAR(D3)+25,MONTH(D3),DAY(D3)))","v":""},null,null,null,"Ansat før","2012-01-01",{"$f":"IF(I3<I4,1,0)","v":0},null,null,null,null,"Mdr",{"$f":"SUM(N11:N34)","v":0},{"$f":"P4+Q5","v":0},{"$f":"VLOOKUP(Q4,Tidsangivelser!$E$4:$G$54,3,TRUE)","v":0},{"$f":"Q4-R4*12","v":0}]
[null,null,null,null,null,null,null,null,null,null,null,null,null,null,"Dage",{"$f":"TRUNC(SUM(P11:P30))","v":0},{"$f":"VLOOKUP(P5,Tidsangivelser!$J$4:$L$54,3,TRUE)","v":0},null,{"$f":"P5-Q5*30","v":0}]
[]
[null,null,"Ansættelsesperioder"]
[null,null,"Fra indlæsningsark",null,null,null,null,null,null,null,null,"År, mdr og dage i hver periode"]
[]
[null,"Fyldt 25 år (start)","Start","Slut","Fyldt 25 år (slut) ",null,null,"Start","Slut","Antal dage i periode",null,"År","Rest","Mdr","Rest","Dage",null,"ÅR","Mdr","Dage"]
["Tabel 7A",{"$f":"IF(C11=\"\",0,IF(C11<$D$4,0,1))","v":0},{"$f":"IF('P-alderskema'!G18=\"\",\"\",'P-alderskema'!G18)","v":""},{"$f":"IF('P-alderskema'!H18=\"\",\"\",'P-alderskema'!H18)","v":""},{"$f":"IF(D11=\"\",0,IF(D11<$D$4,0,1))","v":0},null,null,{"$f":"IF($J$4=0,C11,IF(AND(B11=0,E11=1),$D$4,IF(AND(B11=1,E11=1),C11,\"-\")))","v":""},{"$f":"IF($J$4=0,D11,IF(E11=1,D11,\"-\"))","v":""},{"$f":"IF(OR(I11=\"-\",I11=\"\"),0,DAYS360(H11,I11,TRUE))","v":0},null,{"$f":"TRUNC(J11/360)","v":0},{"$f":"J11-L11*360","v":0},{"$f":"TRUNC(M11/30)","v":0},{"$f":"M11-N11*30","v":0},{"$f":"O11","v":0},null,{"$f":"IF(L11=0,\"\",L11)","v":""},{"$f":"IF(N11=0,\"\",N11)","v":""},{"$f":"IF(P11=0,\"\",P11)","v":""},null,"Tabel 7a"]
[null,0,{"$f":"IF('P-alderskema'!G19=\"\",\"\",'P-alderskema'!G19)","v":""},{"$f":"IF('P-alderskema'!H19=\"\",\"\",'P-alderskema'!H19)","v":""},{"$f":"IF(D12=\"\",0,IF(D12<$D$4,0,1))","v":0},null,null,{"$f":"IF($J$4=0,C12,IF(AND(B12=0,E12=1),$D$4,IF(AND(B12=1,E12=1),C12,\"-\")))","v":""},{"$f":"IF($J$4=0,D12,IF(E12=1,D12,\"-\"))","v":""},{"$f":"IF(OR(I12=\"-\",I12=\"\"),0,DAYS360(H12,I12,TRUE))","v":0},null,0,0,{"$f":"TRUNC(M12/30)","v":0},0,{"$f":"O12","v":0},null,"","",{"$f":"IF(P12=0,\"\",P12)","v":""},null,"År",{"$f":"SUM(L11:L30)","v":0},null,{"$f":"W12+Y13","v":0},{"$f":"Y12","v":0}]
[null,0,{"$f":"IF('P-alderskema'!G20=\"\",\"\",'P-alderskema'!G20)","v":""},{"$f":"IF('P-alderskema'!H20=\"\",\"\",'P-alderskema'!H20)","v":""},0,null,null,"","",0,null,0,0,0,0,0,null,"","","",null,"Mdr",{"$f":"SUM(N11:N30)","v":0},{"$f":"W13+X14","v":0},{"$f":"VLOOKUP(X13,Tidsangivelser!$E$4:$G$54,3,TRUE)","v":0},{"$f":"X13-Y13*12","v":0}]
[null,0,{"$f":"IF('P-alderskema'!G21=\"\",\"\",'P-alderskema'!G21)","v":""},{"$f":"IF('P-alderskema'!H21=\"\",\"\",'P-alderskema'!H21)","v":""},{"$f":"IF(D14=\"\",0,IF(D14<$D$4,0,1))","v":0},null,null,{"$f":"IF($J$4=0,C14,IF(AND(B14=0,E14=1),$D$4,IF(AND(B14=1,E14=1),C14,\"-\")))","v":""},"",0,null,0,0,0,0,0,null,"","","",null,"Dage",{"$f":"TRUNC(SUM(P11:P30))","v":0},{"$f":"VLOOKUP(W14,Tidsangivelser!$J$4:$L$54,3,TRUE)","v":0},null,{"$f":"W14-X14*30","v":0}]
[null,0,{"$f":"IF('P-alderskema'!G22=\"\",\"\",'P-alderskema'!G22)","v":""},{"$f":"IF('P-alderskema'!H22=\"\",\"\",'P-alderskema'!H22)","v":""},0,null,null,"","",0,null,0,0,0,0,0,null,"","",""]
[null,0,{"$f":"IF('P-alderskema'!G23=\"\",\"\",'P-alderskema'!G23)","v":""},{"$f":"IF('P-alderskema'!H23=\"\",\"\",'P-alderskema'!H23)","v":""},0,null,null,"","",0,null,0,0,0,0,0,null,"","",""]
[null,0,{"$f":"IF('P-alderskema'!G24=\"\",\"\",'P-alderskema'!G24)","v":""},{"$f":"IF('P-alderskema'!H24=\"\",\"\",'P-alderskema'!H24)","v":""},0,null,null,"","",0,null,0,0,0,0,0,null,"","",""]
[null,{"$f":"IF(C18=\"\",0,IF(C18<$D$4,0,1))","v":0},{"$f":"IF('P-alderskema'!G25=\"\",\"\",'P-alderskema'!G25)","v":""},{"$f":"IF('P-alderskema'!H25=\"\",\"\",'P-alderskema'!H25)","v":""},{"$f":"IF(D18=\"\",0,IF(D18<$D$4,0,1))","v":0},null,null,{"$f":"IF($J$4=0,C18,IF(AND(B18=0,E18=1),$D$4,IF(AND(B18=1,E18=1),C18,\"-\")))","v":""},"",0,null,0,0,0,0,0,null,"","",""]
[null,0,{"$f":"IF('P-alderskema'!G26=\"\",\"\",'P-alderskema'!G26)","v":""},{"$f":"IF('P-alderskema'!H26=\"\",\"\",'P-alderskema'!H26)","v":""},0,null,null,"","",0,null,0,0,0,0,0,null,"","",""]
[null,0,{"$f":"IF('P-alderskema'!G27=\"\",\"\",'P-alderskema'!G27)","v":""},{"$f":"IF('P-alderskema'!H27=\"\",\"\",'P-alderskema'!H27)","v":""},0,null,null,"","",0,null,0,0,0,0,0,null,"","",""]
{"$rows_left_out":496}
{"sheet":"Tidsangivelser","index":4,"n_rows":54,"n_cols":26,"rows_kept":54,"cut":false,"hidden":true,"merged":[[0,3,0,6],[0,8,0,11],[1,0,1,1],[1,3,1,6],[1,8,1,11]]}
[null,null,null,"Omregning af måneder til år",null,null,null,null,"Omregning af dage til måneder ",null,null,null,null,null,null,null,null,"Fra \"Jubilæumsberegner\" "]
["Omregning af deltidsangivelser",null,null,"12 md., hver med 30 dage, dvs. 12 md = 1 år = 360 dage",null,null,null,null,"Antager at der er 30 dage i hver måned, dvs. 30 dage = 1 md"]
[{"$f":"1/1","v":1},"på fuldtid",null,null,"Start md.","Slut md.","Antal tillægsår",null,null,"Start dag","Slut dag","Antal tillægsmåneder",null,null,null,null,null,"Måned","Startdato","Slutdato","Antal dage","DAGE360","Vægt pr. dag i periode","ikke skudår","skudår","Periode kun 1 dag"]
[{"$f":"1/2","v":0.5},"på 1/2-tid",null,0,{"$f":"D4*12","v":0},{"$f":"(D4+1)*12-1","v":11},0,null,0,{"$f":"I4*30","v":0},{"$f":"(I4+1)*30-1","v":29},0,null,null,null,null,null,1,1,30,30,{"$f":"DAYS360(S4,T4)","v":29},{"$f":"1","v":1},1,1,1]
[{"$f":"1/3","v":0.33333333333333331},"på 1/3-tid",null,1,{"$f":"D5*12","v":12},{"$f":"(D5+1)*12-1","v":23},1,null,1,{"$f":"I5*30","v":30},{"$f":"(I5+1)*30-1","v":59},1,null,null,null,null,null,1,31,31,0,{"$f":"DAYS360(S5,T5)","v":0},0,1,1,0]
[{"$f":"1/4","v":0.25},"på 1/4-tid",null,2,24,35,2,null,2,60,89,2,null,null,null,null,null,1,31,31,1,null,1,1,1,1]
[{"$f":"3/4","v":0.75},"på 3/4-tid",null,3,36,47,3,null,3,90,119,3,null,null,null,null,null,2,1,27,27,{"$f":"DAYS360(S7,T7)","v":26},1,1,0,1]
[{"$f":"1/5","v":0.2},"på 1/5-tid",null,4,48,59,4,null,4,120,149,4,null,null,null,null,null,2,28,28,3,{"$f":"DAYS360(S8,T8)","v":0},3,1,0,1]
[{"$f":"2/5","v":0.4},"på 2/5-tid",null,5,60,71,5,null,5,150,179,5,null,null,null,null,null,2,1,28,28,{"$f":"DAYS360(S9,T9)","v":27},1,0,1,1]
[{"$f":"3/5","v":0.6},"på 3/5-tid",null,6,72,83,6,null,6,180,209,6,null,null,null,null,null,2,29,29,2,{"$f":"DAYS360(S10,T10)","v":0},2,0,1,1]
[{"$f":"4/5","v":0.8},"på 4/5-tid",null,7,84,95,7,null,7,210,239,7,null,null,null,null,null,3,1,30,30,{"$f":"DAYS360(S11,T11)","v":29},1,1,1,1]
[null,null,null,8,96,107,8,null,8,240,269,8,null,null,null,null,null,3,31,31,0,0,0,1,1,0]
[null,null,null,9,108,119,9,null,9,270,299,9,null,null,null,null,null,3,31,31,1,0,1,1,1,1]
[null,null,null,10,120,131,10,null,10,300,329,10,null,null,null,null,null,4,1,30,30,29,1,1,1,1]
[null,null,null,11,132,143,11,null,11,330,359,11,null,null,null,null,null,5,1,30,30,29,1,1,1,1]
[null,null,null,12,144,155,12,null,12,360,389,12,null,null,null,null,null,5,31,31,0,0,0,1,1,0]
[null,null,null,13,156,167,13,null,13,390,419,13,null,null,null,null,null,5,31,31,1,0,1,1,1,1]
[null,null,null,14,168,179,14,null,14,420,449,14,null,null,null,null,null,6,1,30,30,29,1,1,1,1]
[null,null,null,15,180,191,15,null,15,450,479,15,null,null,null,null,null,7,1,30,30,29,1,1,1,1]
[null,null,null,16,192,203,16,null,16,480,509,16,null,null,null,null,null,7,31,31,0,0,0,1,1,0]
{"$rows_left_out":34}